{"text_format":"1","workbook":"xlsx","n_sheets":16,"sheets":["LEGGIMI","ESEMPIO","Dicembre-2017","Gennaio","Febbraio","Marzo","Aprile","Maggio","Giugno","Luglio","Agosto","Settembre","Ottobre","Novembre","Dicembre","Gennaio-2019"],"not_rendered":{"charts":0,"images":0,"macros":1,"external_links":0,"defined_names":0,"comments":0,"pivot_tables":0},"unopened":[],"bounds":{"document_bytes":16777216,"sheet_cells":100000,"rows_first":2000,"rows_last":500,"rows_between":2000,"halvings":0,"cell_chars":16384,"cell_head_chars":4096},"cells_cut":0,"cells_raw":0,"read":"whole","date_system":"1900"}

{"sheet":"LEGGIMI","index":0,"n_rows":19,"n_cols":2,"rows_kept":19,"cut":false,"hidden":false,"merged":[[0,1,1,1],[18,1,19,1]]}
[null,"QUESTO FILE UTILIZZA IL PROGRAMMA DI EXCEL"]
[]
[null,"Semplice programma per tenere sotto controllo le spese utilizzando Carta Prepagata, Carta di Credito, Bancomat "]
[null,"e Assegni. Visualizzando l'esempio, inserire nella riga 40 colonna C di ciascun foglio, lo stipendio del mese,"]
[null,"(vedi foglio di ESEMPIO, Capitale Iniziale = €1500,00 e così per gli altri mesi). Nella sezione Carta Prepagata,"]
[null," inserire nella cella \"Ricariche\" il valore che desiderate utilizzare, segnare le varie spese di seguito nelle righe,"]
[null," come nell'esempio, per facilitare i conteggi delle formule inserite. Una volta inseriti i dati sopra descritti,"]
[null," inserire nelle celle relative alle spese, il valore della spesa sostenuta nelle celle inerenti alle Carte, Bancomat o Assegno,"]
[null," dove verranno detratte dal Capitale Attuale insieme ai Prelievi. Sia nella colonna Spese Carta Prepagata"]
[null," che nelle altre colonne, si eseguono somme che servono per i conteggi. Il Capitale Attuale nella cella L39"]
[null," di colore blu, è calcolato sottraendo il Capitale Iniziale meno il totale delle spese: (Ricariche, Carta di Credito,"]
[null,"Bancomat, Assegni e Prelievi). Negli altri mesi, il Capitale Attuale è uguale al Capitale Attuale del mese precedente,"]
[null,"  poi vengono sottratte le spese, in più viene addizionato lo stipendio del mese corrente. Se il risultato"]
[null,"fosse uguale a 1 o negativo, nella riga sottostante apparirà un avviso di \"Capitale in negativo\" di colore rosso."]
[null,"NB: Voloendo è possibile inserire il numero delle Carte, Bancomat e Assegni al posto delle \"xxxxx\"."]
[null,"Spero di farvi cosa gradita nell'utilizzare questo semplice programma in Excel."]
[null,"PS: i fogli sono protetti da password per evitare errori di battitura."]
[null,"Un cordiale saluto - Buon Lavoro - Program By Maurizio Vignazzi."]
[null,"E-mail: maurivi53@libero.it"]

{"sheet":"ESEMPIO","index":1,"n_rows":40,"n_cols":13,"rows_kept":40,"cut":false,"hidden":false,"merged":[[2,0,3,0],[2,5,3,5],[0,11,35,11],[0,9,35,9],[0,7,35,7],[0,4,35,4],[39,0,39,1],[39,6,39,7],[39,10,39,12],[1,0,1,3],[0,0,0,3],[38,11,38,12],[38,0,38,2],[38,6,38,7],[0,12,3,12],[2,10,3,10],[2,8,3,8],[2,6,3,6],[2,3,3,3],[2,2,3,2],[2,1,3,1]]}
["N° CARTA PREPAGATA",null,null,null,null,null,"N° CARTA di CREDITO",null,"N° BANCOMAT",null,"N° ASSEGNI",null,"Prelievi"]
["XXXXX",null,null,null,null,null,"XXXXX",null,"XXXXX",null,"XXXXX"]
["Ricariche","CAPITALE","SPESE","RESTANTE",null,"Giorni","SPESE",null,"SPESE",null,"SPESE"]
[]
[150,150,25,125,null,"L-1",150,null,55,null,150,null,100]
[null,125,30,95,null,"M-2"]
[null,95,35,60,null,"M-3",null,null,null,null,350]
[null,60,75,"Caricare la carta",null,"G-4",null,null,25]
[100,160,null,null,null,"V-5",50]
[null,null,null,null,null,"S-6"]
[null,null,null,null,null,"D-7",null,null,null,null,null,null,200]
[null,null,null,null,null,"L-8"]
[null,null,null,null,null,"M-9"]
[null,null,null,null,null,"M-10"]
[null,null,null,null,null,"G-11"]
[null,null,null,null,null,"V-12"]
[null,null,null,null,null,"S-13"]
[null,null,null,null,null,"D-14"]
[null,null,null,null,null,"L-15"]
[null,null,null,null,null,"M-16"]
[null,null,null,null,null,"M-17"]
[null,null,null,null,null,"G-18"]
[null,null,null,null,null,"V-19"]
[null,null,null,null,null,"S-20"]
[null,null,null,null,null,"D-21"]
[null,null,null,null,null,"L-22"]
[null,null,null,null,null,"M-23"]
[null,null,null,null,null,",-24"]
[null,null,null,null,null,"G-25"]
[null,null,null,null,null,"V-26"]
[null,null,null,null,null,"S-27"]
[null,null,null,null,null,"D-28"]
[null,null,null,null,null,"L-29"]
[null,null,null,null,null,"M-30"]
[null,null,null,null,null,"M-31"]
[]
[]
[{"$f":"SUM(A5:A36)","v":250},null,{"$f":"SUM(C5:C36)","v":165},null,null,null,{"$f":"SUM(G5:G35)","v":200},null,{"$f":"SUM(I5:I35)","v":80},null,{"$f":"SUM(K5:K35)","v":500},null,{"$f":"SUM(M5:M35)","v":300}]
["Mese di Gennaio - 2018",null,null,null,null,null,"Totali Spese Sostenute",null,{"$f":"SUM(C38+G38+I38+K38+M38)","v":1245},null,"Capitale Attuale",{"$f":"SUM(C40-A38-G38-I38-K38-M38)","v":170}]
["CAPITALE INIZIALE",null,1500,null,null,null,"Debito a metà del mese successivo",null,450,null,{"$f":"IF(L39<=1,\"ATTENZIONE: capitale in negativo!\",\"\")","v":""}]

{"sheet":"Dicembre-2017","index":2,"n_rows":40,"n_cols":13,"rows_kept":40,"cut":false,"hidden":false,"merged":[[2,0,3,0],[2,5,3,5],[0,11,35,11],[0,9,35,9],[0,7,35,7],[0,4,35,4],[39,0,39,1],[39,6,39,7],[39,10,39,12],[0,0,0,3],[1,0,1,3],[38,0,38,2],[38,6,38,7],[38,11,38,12],[0,12,3,12],[2,10,3,10],[2,8,3,8],[2,6,3,6],[2,3,3,3],[2,2,3,2],[2,1,3,1]]}
["N° CARTA PREPAGATA",null,null,null,null,null,"N° CARTA di CREDITO",null,"N° BANCOMAT",null,"N° ASSEGNI",null,"Prelievi"]
[3180,null,null,null,null,null,"XXXXX",null,"XXXXX",null,"XXXXX"]
["Ricariche","CAPITALE","SPESE","RESTANTE",null,"Giorni","SPESE",null,"SPESE",null,"SPESE"]
[]
[null,{"$f":"A5","v":0},null,{"$f":"IF(B5=\"\",\"\",IF(C5=\"\",\"\",IF(B5-C5=\"\",\"\",IF(B5-C5<=0,\"Caricare la Carta\",B5-C5))))","v":""},null,"V-1"]
[null,{"$f":"IF(D5=\"\",\"\",IF(B5-C5=0,A6,IF(OR(D5=\"Caricare la Carta\",D5=B5),A6+B5,D5)))","v":""},null,{"$f":"IF(B6=\"\",\"\",IF(C6=\"\",\"\",IF(B6-C6=\"\",\"\",IF(B6-C6<=0,\"Caricare la Carta\",B6-C6))))","v":""},null,"S-2"]
[null,{"$f":"IF(D6=\"\",\"\",IF(B6-C6=0,A7,IF(OR(D6=\"Caricare la Carta\",D6=B6),A7+B6,D6)))","v":""},null,"",null,"D-3"]
[null,"",null,"",null,"L-4"]
[null,"",null,"",null,"M-5"]
[null,"",null,"",null,"M-6"]
[null,"",null,"",null,"G-7"]
[null,"",null,"",null,"V-8"]
[null,"",null,"",null,"S-9"]
[null,"",null,"",null,"D-10"]
[null,"",null,"",null,"L-11"]
[null,"",null,"",null,"M-12"]
[null,"",null,"",null,"M-13"]
[null,"",null,"",null,"G-14"]
[null,"",null,"",null,"V-15"]
[null,"",null,"",null,"S-16"]
[null,"",null,"",null,"D-17"]
[null,"",null,"",null,"L-18"]
[null,"",null,"",null,"M-19"]
[null,"",null,"",null,"M-20"]
[null,"",null,"",null,"G-21"]
[null,"",null,"",null,"V-22"]
[null,"",null,"",null,"S-23"]
[null,"",null,"",null,"D-24"]
[null,"",null,"",null,"L-25"]
[null,"",null,"",null,"M-26"]
[null,"",null,"",null,"M-27"]
[null,"",null,"",null,"G-28"]
[null,"",null,"",null,"V-29"]
[null,"",null,"",null,"S-30"]
[null,"",null,"",null,"D-31"]
[null,"",null,""]
[]
[{"$f":"SUM(A5:A36)","v":0},null,{"$f":"SUM(C5:C36)","v":0},null,null,null,{"$f":"SUM(G5:G35)","v":0},null,{"$f":"SUM(I5:I35)","v":0},null,{"$f":"SUM(K5:K35)","v":0},null,{"$f":"SUM(M5:M35)","v":0}]
["Mese di Dicembre - 2017",null,null,null,null,null,"Totali Spese Sostenute",null,{"$f":"C38+G38+I38+K38+M38","v":0},null,"Capitale Attuale",{"$f":"SUM(C40-A38-G38-I38-K38-M38)","v":0}]
["CAPITALE INIZIALE",null,null,null,null,null,"Debito a metà del mese successivo",null,{"$f":"SUM(G5:G14)","v":0},null,{"$f":"IF(L39<=1,\"ATTENZIONE: capitale in negativo!\",\"\")","v":"ATTENZIONE: capitale in negativo!"}]

{"sheet":"Gennaio","index":3,"n_rows":40,"n_cols":13,"rows_kept":40,"cut":false,"hidden":false,"merged":[[2,0,3,0],[2,5,3,5],[0,11,35,11],[0,9,35,9],[0,7,35,7],[0,4,35,4],[39,0,39,1],[39,6,39,7],[39,10,39,12],[1,0,1,3],[0,0,0,3],[38,11,38,12],[38,0,38,2],[38,6,38,7],[0,12,3,12],[2,10,3,10],[2,8,3,8],[2,6,3,6],[2,3,3,3],[2,2,3,2],[2,1,3,1]]}
["N° CARTA PREPAGATA",null,null,null,null,null,"N° CARTA di CREDITO",null,"N° BANCOMAT",null,"N° ASSEGNI",null,"Prelievi"]
["XXXXX",null,null,null,null,null,"XXXXX",null,"XXXXX",null,"XXXXX"]
["Ricariche","CAPITALE","SPESE","RESTANTE",null,"Giorni","SPESE",null,"SPESE",null,"SPESE"]
[]
[{"$f":"'Dicembre-2017'!A38-'Dicembre-2017'!C38","v":0},{"$f":"A5","v":0},null,{"$f":"IF(B5=\"\",\"\",IF(C5=\"\",\"\",IF(B5-C5=\"\",\"\",IF(B5-C5<=0,\"Caricare la Carta\",B5-C5))))","v":""},null,"L-1"]
[null,{"$f":"IF(D5=\"\",\"\",IF(B5-C5=0,A6,IF(OR(D5=\"Caricare la Carta\",D5=B5),A6+B5,D5)))","v":""},null,{"$f":"IF(B6=\"\",\"\",IF(C6=\"\",\"\",IF(B6-C6=\"\",\"\",IF(B6-C6<=0,\"Caricare la Carta\",B6-C6))))","v":""},null,"M-2"]
[null,{"$f":"IF(D6=\"\",\"\",IF(B6-C6=0,A7,IF(OR(D6=\"Caricare la Carta\",D6=B6),A7+B6,D6)))","v":""},null,"",null,"M-3"]
[null,"",null,"",null,"G-4"]
[null,"",null,"",null,"V-5"]
[null,"",null,"",null,"S-6"]
[null,"",null,"",null,"D-7"]
[null,"",null,"",null,"L-8"]
[null,"",null,"",null,"M-9"]
[null,"",null,"",null,"M-10"]
[null,"",null,"",null,"G-11"]
[null,"",null,"",null,"V-12"]
[null,"",null,"",null,"S-13"]
[null,"",null,"",null,"D-14"]
[null,"",null,"",null,"L-15"]
[null,"",null,"",null,"M-16"]
[null,"",null,"",null,"M-17"]
[null,"",null,"",null,"G-18"]
[null,"",null,"",null,"V-19"]
[null,"",null,"",null,"S-20"]
[null,"",null,"",null,"D-21"]
[null,"",null,"",null,"L-22"]
[null,"",null,"",null,"M-23"]
[null,"",null,"",null,"M-24"]
[null,"",null,"",null,"G-25"]
[null,"",null,"",null,"V-26"]
[null,"",null,"",null,"S-27"]
[null,"",null,"",null,"D-28"]
[null,"",null,"",null,"L-29"]
[null,"",null,"",null,"M-30"]
[null,"",null,"",null,"M-31"]
[null,"",null,""]
[]
[{"$f":"SUM(A5:A36)","v":0},null,{"$f":"SUM(C5:C36)","v":0},null,null,null,{"$f":"SUM(G5:G35)","v":0},null,{"$f":"SUM(I5:I35)","v":0},null,{"$f":"SUM(K5:K35)","v":0},null,{"$f":"SUM(M5:M35)","v":0}]
["Mese di Gennaio - 2018",null,null,null,null,null,"Totali Spese Sostenute",null,{"$f":"C38+G38+I38+K38+M38","v":0},null,"Capitale Attuale",{"$f":"SUM('Dicembre-2017'!L39)-SUM(A38-G38-I38-K38-M38)+C40","v":0}]
["CAPITALE INIZIALE",null,null,null,null,null,"Debito a metà del mese successivo",null,{"$f":"SUM('Dicembre-2017'!G15:G35)+SUM(G5:G14)","v":0},null,{"$f":"IF(L39<=1,\"ATTENZIONE: capitale in negativo!\",\"\")","v":"ATTENZIONE: capitale in negativo!"}]

{"sheet":"Febbraio","index":4,"n_rows":40,"n_cols":13,"rows_kept":40,"cut":false,"hidden":false,"merged":[[2,0,3,0],[2,5,3,5],[0,11,35,11],[0,9,35,9],[0,7,35,7],[0,4,35,4],[39,0,39,1],[39,6,39,7],[39,10,39,12],[1,0,1,3],[0,0,0,3],[38,11,38,12],[38,0,38,2],[38,6,38,7],[0,12,3,12],[2,10,3,10],[2,8,3,8],[2,6,3,6],[2,3,3,3],[2,2,3,2],[2,1,3,1]]}
["N° CARTA PREPAGATA",null,null,null,null,null,"N° CARTA di CREDITO",null,"N° BANCOMAT",null,"N° ASSEGNI",null,"Prelievi"]
["XXXXX",null,null,null,null,null,"XXXXX",null,"XXXXX",null,"XXXXX"]
["Ricariche","CAPITALE","SPESE","RESTANTE",null,"Giorni","SPESE",null,"SPESE",null,"SPESE"]
[]
[{"$f":"Gennaio!A38-Gennaio!C38","v":0},{"$f":"A5","v":0},null,{"$f":"IF(B5=\"\",\"\",IF(C5=\"\",\"\",IF(B5-C5=\"\",\"\",IF(B5-C5<=0,\"Caricare la Carta\",B5-C5))))","v":""},null,"G-1"]
[null,{"$f":"IF(D5=\"\",\"\",IF(B5-C5=0,A6,IF(OR(D5=\"Caricare la Carta\",D5=B5),A6+B5,D5)))","v":""},null,{"$f":"IF(B6=\"\",\"\",IF(C6=\"\",\"\",IF(B6-C6=\"\",\"\",IF(B6-C6<=0,\"Caricare la Carta\",B6-C6))))","v":""},null,"V-2"]
[null,{"$f":"IF(D6=\"\",\"\",IF(B6-C6=0,A7,IF(OR(D6=\"Caricare la Carta\",D6=B6),A7+B6,D6)))","v":""},null,"",null,"S-3"]
[null,"",null,"",null,"D-4"]
[null,"",null,"",null,"L-5"]
[null,"",null,"",null,"M-6"]
[null,"",null,"",null,"M-7"]
[null,"",null,"",null,"G-8"]
[null,"",null,"",null,"V-9"]
[null,"",null,"",null,"S-10"]
[null,"",null,"",null,"D-11"]
[null,"",null,"",null,"L-12"]
[null,"",null,"",null,"M-13"]
[null,"",null,"",null,"M-14"]
[null,"",null,"",null,"G-15"]
[null,"",null,"",null,"V-16"]
[null,"",null,"",null,"S-17"]
[null,"",null,"",null,"D-18"]
[null,"",null,"",null,"L-19"]
[null,"",null,"",null,"M-20"]
[null,"",null,"",null,"M-21"]
[null,"",null,"",null,"G-22"]
[null,"",null,"",null,"V-23"]
[null,"",null,"",null,"S-24"]
[null,"",null,"",null,"D-25"]
[null,"",null,"",null,"L-26"]
[null,"",null,"",null,"M-27"]
[null,"",null,"",null,"M-28"]
[null,"",null,""]
[null,"",null,""]
[null,"",null,""]
[null,"",null,""]
[]
[{"$f":"SUM(A5:A36)","v":0},null,{"$f":"SUM(C5:C36)","v":0},null,null,null,{"$f":"SUM(G5:G35)","v":0},null,{"$f":"SUM(I5:I35)","v":0},null,{"$f":"SUM(K5:K35)","v":0},null,{"$f":"SUM(M5:M35)","v":0}]
["Mese di Febbraio - 2018",null,null,null,null,null,"Totali Spese Sostenute",null,{"$f":"C38+G38+I38+K38+M38","v":0},null,"Capitale Attuale",{"$f":"SUM(Gennaio!L39)-SUM(A38-G38-I38-K38-M38)+C40","v":0}]
["CAPITALE INIZIALE",null,null,null,null,null,"Debito a metà del mese successivo",null,{"$f":"SUM(Gennaio!G15:G35)+SUM(G5:G14)","v":0},null,{"$f":"IF(L39<=1,\"ATTENZIONE: capitale in negativo!\",\"\")","v":"ATTENZIONE: capitale in negativo!"}]

{"sheet":"Marzo","index":5,"n_rows":40,"n_cols":13,"rows_kept":40,"cut":false,"hidden":false,"merged":[[2,0,3,0],[2,5,3,5],[0,11,35,11],[0,9,35,9],[0,7,35,7],[0,4,35,4],[39,0,39,1],[39,6,39,7],[39,10,39,12],[1,0,1,3],[0,0,0,3],[38,0,38,2],[38,11,38,12],[38,6,38,7],[0,12,3,12],[2,10,3,10],[2,8,3,8],[2,6,3,6],[2,3,3,3],[2,2,3,2],[2,1,3,1]]}
["N° CARTA PREPAGATA",null,null,null,null,null,"N° CARTA di CREDITO",null,"N° BANCOMAT",null,"N° ASSEGNI",null,"Prelievi"]
["XXXXX",null,null,null,null,null,"XXXXX",null,"XXXXX",null,"XXXXX"]
["Ricariche","CAPITALE","SPESE","RESTANTE",null,"Giorni","SPESE",null,"SPESE",null,"SPESE"]
[]
[{"$f":"Febbraio!A38-Febbraio!C38","v":0},{"$f":"A5","v":0},null,{"$f":"IF(B5=\"\",\"\",IF(C5=\"\",\"\",IF(B5-C5=\"\",\"\",IF(B5-C5<=0,\"Caricare la Carta\",B5-C5))))","v":""},null,"G-1"]
[null,{"$f":"IF(D5=\"\",\"\",IF(B5-C5=0,A6,IF(OR(D5=\"Caricare la Carta\",D5=B5),A6+B5,D5)))","v":""},null,{"$f":"IF(B6=\"\",\"\",IF(C6=\"\",\"\",IF(B6-C6=\"\",\"\",IF(B6-C6<=0,\"Caricare la Carta\",B6-C6))))","v":""},null,"V-2"]
[null,{"$f":"IF(D6=\"\",\"\",IF(B6-C6=0,A7,IF(OR(D6=\"Caricare la Carta\",D6=B6),A7+B6,D6)))","v":""},null,"",null,"S-3"]
[null,"",null,"",null,"D-4"]
[null,"",null,"",null,"L-5"]
[null,"",null,"",null,"M-6"]
[null,"",null,"",null,"M-7"]
[null,"",null,"",null,"G-8"]
[null,"",null,"",null,"V-9"]
[null,"",null,"",null,"S-10"]
[null,"",null,"",null,"D-11"]
[null,"",null,"",null,"L-12"]
[null,"",null,"",null,"M-13"]
[null,"",null,"",null,"M-14"]
[null,"",null,"",null,"G-15"]
[null,"",null,"",null,"V-16"]
[null,"",null,"",null,"S-17"]
[null,"",null,"",null,"D-18"]
[null,"",null,"",null,"L-19"]
[null,"",null,"",null,"M-20"]
[null,"",null,"",null,"M-21"]
[null,"",null,"",null,"G-22"]
[null,"",null,"",null,"V-23"]
[null,"",null,"",null,"S-24"]
[null,"",null,"",null,"D-25"]
[null,"",null,"",null,"L-26"]
[null,"",null,"",null,"M-27"]
[null,"",null,"",null,"M-28"]
[null,"",null,"",null,"G-29"]
[null,"",null,"",null,"V-30"]
[null,"",null,"",null,"S-31"]
[null,"",null,""]
[]
[{"$f":"SUM(A5:A36)","v":0},null,{"$f":"SUM(C5:C36)","v":0},null,null,null,{"$f":"SUM(G5:G35)","v":0},null,{"$f":"SUM(I5:I35)","v":0},null,{"$f":"SUM(K5:K35)","v":0},null,{"$f":"SUM(M5:M35)","v":0}]
["Mese di Marzo - 2018",null,null,null,null,null,"Totali Spese Sostenute",null,{"$f":"C38+G38+I38+K38+M38","v":0},null,"Capitale Attuale",{"$f":"SUM(Febbraio!L39)-SUM(A38-G38-I38-K38-M38)+C40","v":0}]
["CAPITALE INIZIALE",null,null,null,null,null,"Debito a metà del mese successivo",null,{"$f":"SUM(Febbraio!G15:G32)+SUM(G5:G14)","v":0},null,{"$f":"IF(L39<=1,\"ATTENZIONE: capitale in negativo!\",\"\")","v":"ATTENZIONE: capitale in negativo!"}]

{"sheet":"Aprile","index":6,"n_rows":40,"n_cols":13,"rows_kept":40,"cut":false,"hidden":false,"merged":[[2,0,3,0],[2,5,3,5],[0,11,35,11],[0,9,35,9],[0,7,35,7],[0,4,35,4],[39,0,39,1],[39,6,39,7],[39,10,39,12],[1,0,1,3],[0,0,0,3],[38,11,38,12],[38,0,38,2],[38,6,38,7],[0,12,3,12],[2,10,3,10],[2,8,3,8],[2,6,3,6],[2,3,3,3],[2,2,3,2],[2,1,3,1]]}
["N° CARTA PREPAGATA",null,null,null,null,null,"N° CARTA di CREDITO",null,"N° BANCOMAT",null,"N° ASSEGNI",null,"Prelievi"]
["XXXXX",null,null,null,null,null,"XXXXX",null,"XXXXX",null,"XXXXX"]
["Ricariche","CAPITALE","SPESE","RESTANTE",null,"Giorni","SPESE",null,"SPESE",null,"SPESE"]
[]
[{"$f":"Marzo!A38-Marzo!C38","v":0},{"$f":"A5","v":0},null,{"$f":"IF(B5=\"\",\"\",IF(C5=\"\",\"\",IF(B5-C5=\"\",\"\",IF(B5-C5<=0,\"Caricare la Carta\",B5-C5))))","v":""},null,"D-1"]
[null,{"$f":"IF(D5=\"\",\"\",IF(B5-C5=0,A6,IF(OR(D5=\"Caricare la Carta\",D5=B5),A6+B5,D5)))","v":""},null,{"$f":"IF(B6=\"\",\"\",IF(C6=\"\",\"\",IF(B6-C6=\"\",\"\",IF(B6-C6<=0,\"Caricare la Carta\",B6-C6))))","v":""},null,"L-2"]
[null,{"$f":"IF(D6=\"\",\"\",IF(B6-C6=0,A7,IF(OR(D6=\"Caricare la Carta\",D6=B6),A7+B6,D6)))","v":""},null,"",null,"M-3"]
[null,"",null,"",null,"M-4"]
[null,"",null,"",null,"G-5"]
[null,"",null,"",null,"V-6"]
[null,"",null,"",null,"S-7"]
[null,"",null,"",null,"D-8"]
[null,"",null,"",null,"L-9"]
[null,"",null,"",null,"M-10"]
[null,"",null,"",null,"M-11"]
[null,"",null,"",null,"G-12"]
[null,"",null,"",null,"V-13"]
[null,"",null,"",null,"S-14"]
[null,"",null,"",null,"D-15"]
[null,"",null,"",null,"L-16"]
[null,"",null,"",null,"M-17"]
[null,"",null,"",null,"M-18"]
[null,"",null,"",null,"G-19"]
[null,"",null,"",null,"V-20"]
[null,"",null,"",null,"S-21"]
[null,"",null,"",null,"D-22"]
[null,"",null,"",null,"L-23"]
[null,"",null,"",null,"M-24"]
[null,"",null,"",null,"M-25"]
[null,"",null,"",null,"G-26"]
[null,"",null,"",null,"V-27"]
[null,"",null,"",null,"S-28"]
[null,"",null,"",null,"D-29"]
[null,"",null,"",null,"L-30"]
[null,"",null,""]
[null,"",null,""]
[]
[{"$f":"SUM(A5:A36)","v":0},null,{"$f":"SUM(C5:C36)","v":0},null,null,null,{"$f":"SUM(G5:G35)","v":0},null,{"$f":"SUM(I5:I35)","v":0},null,{"$f":"SUM(K5:K35)","v":0},null,{"$f":"SUM(M5:M35)","v":0}]
["Mese di Aprile - 2018",null,null,null,null,null,"Totali Spese Sostenute",null,{"$f":"C38+G38+I38+K38+M38","v":0},null,"Capitale Attuale",{"$f":"SUM(Marzo!L39)-SUM(A38-G38-I38-K38-M38)+C40","v":0}]
["CAPITALE INIZIALE",null,null,null,null,null,"Debito a metà del mese successivo",null,{"$f":"SUM(Marzo!G15:G35)+SUM(G5:G14)","v":0},null,{"$f":"IF(L39<=1,\"ATTENZIONE: capitale in negativo!\",\"\")","v":"ATTENZIONE: capitale in negativo!"}]

{"sheet":"Maggio","index":7,"n_rows":40,"n_cols":13,"rows_kept":40,"cut":false,"hidden":false,"merged":[[2,0,3,0],[2,5,3,5],[0,11,35,11],[0,9,35,9],[0,7,35,7],[0,4,35,4],[39,0,39,1],[39,6,39,7],[39,10,39,12],[1,0,1,3],[0,0,0,3],[38,11,38,12],[38,0,38,2],[38,6,38,7],[0,12,3,12],[2,10,3,10],[2,8,3,8],[2,6,3,6],[2,3,3,3],[2,2,3,2],[2,1,3,1]]}
["N° CARTA PREPAGATA",null,null,null,null,null,"N° CARTA di CREDITO",null,"N° BANCOMAT",null,"N° ASSEGNI",null,"Prelievi"]
["XXXXX",null,null,null,null,null,"XXXXX",null,"XXXXX",null,"XXXXX"]
["Ricariche","CAPITALE","SPESE","RESTANTE",null,"Giorni","SPESE",null,"SPESE",null,"SPESE"]
[]
[{"$f":"Aprile!A38-Aprile!C38","v":0},{"$f":"A5","v":0},null,{"$f":"IF(B5=\"\",\"\",IF(C5=\"\",\"\",IF(B5-C5=\"\",\"\",IF(B5-C5<=0,\"Caricare la Carta\",B5-C5))))","v":""},null,"M-1"]
[null,{"$f":"IF(D5=\"\",\"\",IF(B5-C5=0,A6,IF(OR(D5=\"Caricare la Carta\",D5=B5),A6+B5,D5)))","v":""},null,{"$f":"IF(B6=\"\",\"\",IF(C6=\"\",\"\",IF(B6-C6=\"\",\"\",IF(B6-C6<=0,\"Caricare la Carta\",B6-C6))))","v":""},null,"M-2"]
[null,{"$f":"IF(D6=\"\",\"\",IF(B6-C6=0,A7,IF(OR(D6=\"Caricare la Carta\",D6=B6),A7+B6,D6)))","v":""},null,"",null,"G-3"]
[null,"",null,"",null,"V-4"]
[null,"",null,"",null,"S-5"]
[null,"",null,"",null,"D-6"]
[null,"",null,"",null,"L-7"]
[null,"",null,"",null,"M-8"]
[null,"",null,"",null,"M-9"]
[null,"",null,"",null,"G-10"]
[null,"",null,"",null,"V-11"]
[null,"",null,"",null,"S-12"]
[null,"",null,"",null,"D-13"]
[null,"",null,"",null,"L-14"]
[null,"",null,"",null,"M-15"]
[null,"",null,"",null,"M-16"]
[null,"",null,"",null,"G-17"]
[null,"",null,"",null,"V-18"]
[null,"",null,"",null,"S-19"]
[null,"",null,"",null,"D-20"]
[null,"",null,"",null,"L-21"]
[null,"",null,"",null,"M-22"]
[null,"",null,"",null,"M-23"]
[null,"",null,"",null,"G-24"]
[null,"",null,"",null,"V-25"]
[null,"",null,"",null,"S-26"]
[null,"",null,"",null,"D-27"]
[null,"",null,"",null,"L-28"]
[null,"",null,"",null,"M-29"]
[null,"",null,"",null,"M-30"]
[null,"",null,"",null,"G-31"]
[null,"",null,""]
[]
[{"$f":"SUM(A5:A36)","v":0},null,{"$f":"SUM(C5:C36)","v":0},null,null,null,{"$f":"SUM(G5:G35)","v":0},null,{"$f":"SUM(I5:I35)","v":0},null,{"$f":"SUM(K5:K35)","v":0},null,{"$f":"SUM(M5:M35)","v":0}]
["Mese di Maggio - 2018",null,null,null,null,null,"Totali Spese Sostenute",null,{"$f":"C38+G38+I38+K38+M38","v":0},null,"Capitale Attuale",{"$f":"SUM(Aprile!L39)-SUM(A38-G38-I38-K38-M38)+C40","v":0}]
["CAPITALE INIZIALE",null,null,null,null,null,"Debito a metà del mese successivo",null,{"$f":"SUM(Aprile!G15:G34)+SUM(G5:G14)","v":0},null,{"$f":"IF(L39<=1,\"ATTENZIONE: capitale in negativo!\",\"\")","v":"ATTENZIONE: capitale in negativo!"}]

{"sheet":"Giugno","index":8,"n_rows":40,"n_cols":13,"rows_kept":40,"cut":false,"hidden":false,"merged":[[2,0,3,0],[2,5,3,5],[0,11,35,11],[0,9,35,9],[0,7,35,7],[0,4,35,4],[39,0,39,1],[39,6,39,7],[39,10,39,12],[1,0,1,3],[0,0,0,3],[38,11,38,12],[38,0,38,2],[38,6,38,7],[0,12,3,12],[2,10,3,10],[2,8,3,8],[2,6,3,6],[2,3,3,3],[2,2,3,2],[2,1,3,1]]}
["N° CARTA PREPAGATA",null,null,null,null,null,"N° CARTA di CREDITO",null,"N° BANCOMAT",null,"N° ASSEGNI",null,"Prelievi"]
["XXXXX",null,null,null,null,null,"XXXXX",null,"XXXXX",null,"XXXXX"]
["Ricariche","CAPITALE","SPESE","RESTANTE",null,"Giorni","SPESE",null,"SPESE",null,"SPESE"]
[]
[{"$f":"Maggio!A38-Maggio!C38","v":0},{"$f":"A5","v":0},null,{"$f":"IF(B5=\"\",\"\",IF(C5=\"\",\"\",IF(B5-C5=\"\",\"\",IF(B5-C5<=0,\"Caricare la Carta\",B5-C5))))","v":""},null,"V-1"]
[null,{"$f":"IF(D5=\"\",\"\",IF(B5-C5=0,A6,IF(OR(D5=\"Caricare la Carta\",D5=B5),A6+B5,D5)))","v":""},null,{"$f":"IF(B6=\"\",\"\",IF(C6=\"\",\"\",IF(B6-C6=\"\",\"\",IF(B6-C6<=0,\"Caricare la Carta\",B6-C6))))","v":""},null,"S-2"]
[null,{"$f":"IF(D6=\"\",\"\",IF(B6-C6=0,A7,IF(OR(D6=\"Caricare la Carta\",D6=B6),A7+B6,D6)))","v":""},null,"",null,"D-3"]
[null,"",null,"",null,"L-4"]
[null,"",null,"",null,"M-5"]
[null,"",null,"",null,"M-6"]
[null,"",null,"",null,"G-7"]
[null,"",null,"",null,"V-8"]
[null,"",null,"",null,"S-9"]
[null,"",null,"",null,"D-10"]
[null,"",null,"",null,"L-11"]
[null,"",null,"",null,"M-12"]
[null,"",null,"",null,"M-13"]
[null,"",null,"",null,"G-14"]
[null,"",null,"",null,"V-15"]
[null,"",null,"",null,"S-16"]
[null,"",null,"",null,"D-17"]
[null,"",null,"",null,"L-18"]
[null,"",null,"",null,"M-19"]
[null,"",null,"",null,"M-20"]
[null,"",null,"",null,"G-21"]
[null,"",null,"",null,"V-22"]
[null,"",null,"",null,"S-23"]
[null,"",null,"",null,"D-24"]
[null,"",null,"",null,"L-25"]
[null,"",null,"",null,"M-26"]
[null,"",null,"",null,"M-27"]
[null,"",null,"",null,"G-28"]
[null,"",null,"",null,"V-29"]
[null,"",null,"",null,"S-30"]
[null,"",null,""]
[null,"",null,""]
[]
[{"$f":"SUM(A5:A36)","v":0},null,{"$f":"SUM(C5:C36)","v":0},null,null,null,{"$f":"SUM(G5:G35)","v":0},null,{"$f":"SUM(I5:I35)","v":0},null,{"$f":"SUM(K5:K35)","v":0},null,{"$f":"SUM(M5:M35)","v":0}]
["Mese di Giugno - 2018",null,null,null,null,null,"Totali Spese Sostenute",null,{"$f":"C38+G38+I38+K38+M38","v":0},null,"Capitale Attuale",{"$f":"SUM(Maggio!L39)-SUM(A38-G38-I38-K38-M38)+C40","v":0}]
["CAPITALE INIZIALE",null,null,null,null,null,"Debito a metà del mese successivo",null,{"$f":"SUM(Maggio!G15:G35)+SUM(G5:G14)","v":0},null,{"$f":"IF(L39<=1,\"ATTENZIONE: capitale in negativo!\",\"\")","v":"ATTENZIONE: capitale in negativo!"}]

{"sheet":"Luglio","index":9,"n_rows":40,"n_cols":13,"rows_kept":40,"cut":false,"hidden":false,"merged":[[2,0,3,0],[2,5,3,5],[0,11,35,11],[0,9,35,9],[0,7,35,7],[0,4,35,4],[39,0,39,1],[39,6,39,7],[39,10,39,12],[1,0,1,3],[0,0,0,3],[38,0,38,2],[38,11,38,12],[38,6,38,7],[0,12,3,12],[2,10,3,10],[2,8,3,8],[2,6,3,6],[2,3,3,3],[2,2,3,2],[2,1,3,1]]}
["N° CARTA PREPAGATA",null,null,null,null,null,"N° CARTA di CREDITO",null,"N° BANCOMAT",null,"N° ASSEGNI",null,"Prelievi"]
["XXXXX",null,null,null,null,null,"XXXXX",null,"XXXXX",null,"XXXXX"]
["Ricariche","CAPITALE","SPESE","RESTANTE",null,"Giorni","SPESE",null,"SPESE",null,"SPESE"]
[]
[{"$f":"Giugno!A38-Giugno!C38","v":0},{"$f":"A5","v":0},null,{"$f":"IF(B5=\"\",\"\",IF(C5=\"\",\"\",IF(B5-C5=\"\",\"\",IF(B5-C5<=0,\"Caricare la Carta\",B5-C5))))","v":""},null,"D-1"]
[null,{"$f":"IF(D5=\"\",\"\",IF(B5-C5=0,A6,IF(OR(D5=\"Caricare la Carta\",D5=B5),A6+B5,D5)))","v":""},null,{"$f":"IF(B6=\"\",\"\",IF(C6=\"\",\"\",IF(B6-C6=\"\",\"\",IF(B6-C6<=0,\"Caricare la Carta\",B6-C6))))","v":""},null,"L-2"]
[null,{"$f":"IF(D6=\"\",\"\",IF(B6-C6=0,A7,IF(OR(D6=\"Caricare la Carta\",D6=B6),A7+B6,D6)))","v":""},null,"",null,"M-3"]
[null,"",null,"",null,"M-4"]
[null,"",null,"",null,"G-5"]
[null,"",null,"",null,"V-6"]
[null,"",null,"",null,"S-7"]
[null,"",null,"",null,"D-8"]
[null,"",null,"",null,"L-9"]
[null,"",null,"",null,"M-10"]
[null,"",null,"",null,"M-11"]
[null,"",null,"",null,"G-12"]
[null,"",null,"",null,"V-13"]
[null,"",null,"",null,"S-14"]
[null,"",null,"",null,"D-15"]
[null,"",null,"",null,"L-16"]
[null,"",null,"",null,"M-17"]
[null,"",null,"",null,"M-18"]
[null,"",null,"",null,"G-19"]
[null,"",null,"",null,"V-20"]
[null,"",null,"",null,"S-21"]
[null,"",null,"",null,"D-22"]
[null,"",null,"",null,"L-23"]
[null,"",null,"",null,"M-24"]
[null,"",null,"",null,"M-25"]
[null,"",null,"",null,"G-26"]
[null,"",null,"",null,"V-27"]
[null,"",null,"",null,"S-28"]
[null,"",null,"",null,"D-29"]
[null,"",null,"",null,"L-30"]
[null,"",null,"",null,"M-31"]
[null,"",null,""]
[]
[{"$f":"SUM(A5:A36)","v":0},null,{"$f":"SUM(C5:C36)","v":0},null,null,null,{"$f":"SUM(G5:G35)","v":0},null,{"$f":"SUM(I5:I35)","v":0},null,{"$f":"SUM(K5:K35)","v":0},null,{"$f":"SUM(M5:M35)","v":0}]
["Mese di Luglio - 2018",null,null,null,null,null,"Totali Spese Sostenute",null,{"$f":"C38+G38+I38+K38+M38","v":0},null,"Capitale Attuale",{"$f":"SUM(Giugno!L39)-SUM(A38-G38-I38-K38-M38)+C40","v":0}]
["CAPITALE INIZIALE",null,null,null,null,null,"Debito a metà del mese successivo",null,{"$f":"SUM(Giugno!G15:G34)+SUM(G5:G14)","v":0},null,{"$f":"IF(L39<=1,\"ATTENZIONE: capitale in negativo!\",\"\")","v":"ATTENZIONE: capitale in negativo!"}]

{"sheet":"Agosto","index":10,"n_rows":40,"n_cols":13,"rows_kept":40,"cut":false,"hidden":false,"merged":[[2,0,3,0],[2,5,3,5],[0,11,35,11],[0,9,35,9],[0,7,35,7],[0,4,35,4],[39,0,39,1],[39,6,39,7],[39,10,39,12],[1,0,1,3],[0,0,0,3],[38,0,38,2],[38,11,38,12],[38,6,38,7],[0,12,3,12],[2,10,3,10],[2,8,3,8],[2,6,3,6],[2,3,3,3],[2,2,3,2],[2,1,3,1]]}
["N° CARTA PREPAGATA",null,null,null,null,null,"N° CARTA di CREDITO",null,"N° BANCOMAT",null,"N° ASSEGNI",null,"Prelievi"]
["XXXXX",null,null,null,null,null,"XXXXX",null,"XXXXX",null,"XXXXX"]
["Ricariche","CAPITALE","SPESE","RESTANTE",null,"Giorni","SPESE",null,"SPESE",null,"SPESE"]
[]
[{"$f":"Luglio!A38-Luglio!C38","v":0},{"$f":"A5","v":0},null,{"$f":"IF(B5=\"\",\"\",IF(C5=\"\",\"\",IF(B5-C5=\"\",\"\",IF(B5-C5<=0,\"Caricare la Carta\",B5-C5))))","v":""},null,"M-1"]
[null,{"$f":"IF(D5=\"\",\"\",IF(B5-C5=0,A6,IF(OR(D5=\"Caricare la Carta\",D5=B5),A6+B5,D5)))","v":""},null,{"$f":"IF(B6=\"\",\"\",IF(C6=\"\",\"\",IF(B6-C6=\"\",\"\",IF(B6-C6<=0,\"Caricare la Carta\",B6-C6))))","v":""},null,"G-2"]
[null,{"$f":"IF(D6=\"\",\"\",IF(B6-C6=0,A7,IF(OR(D6=\"Caricare la Carta\",D6=B6),A7+B6,D6)))","v":""},null,"",null,"V-3"]
[null,"",null,"",null,"S-4"]
[null,"",null,"",null,"D-5"]
[null,"",null,"",null,"L-6"]
[null,"",null,"",null,"M-7"]
[null,"",null,"",null,"M-8"]
[null,"",null,"",null,"G-9"]
[null,"",null,"",null,"V-10"]
[null,"",null,"",null,"S-11"]
[null,"",null,"",null,"D-12"]
[null,"",null,"",null,"L-13"]
[null,"",null,"",null,"M-14"]
[null,"",null,"",null,"M-15"]
[null,"",null,"",null,"G-16"]
[null,"",null,"",null,"V-17"]
[null,"",null,"",null,"S-18"]
[null,"",null,"",null,"D-19"]
[null,"",null,"",null,"L-20"]
[null,"",null,"",null,"M-21"]
[null,"",null,"",null,"M-22"]
[null,"",null,"",null,"G-23"]
[null,"",null,"",null,"V-24"]
[null,"",null,"",null,"S-25"]
[null,"",null,"",null,"D-26"]
[null,"",null,"",null,"L-27"]
[null,"",null,"",null,"M-28"]
[null,"",null,"",null,"M-29"]
[null,"",null,"",null,"G-30"]
[null,"",null,"",null,"V-31"]
[null,"",null,""]
[]
[{"$f":"SUM(A5:A36)","v":0},null,{"$f":"SUM(C5:C36)","v":0},null,null,null,{"$f":"SUM(G5:G35)","v":0},null,{"$f":"SUM(I5:I35)","v":0},null,{"$f":"SUM(K5:K35)","v":0},null,{"$f":"SUM(M5:M35)","v":0}]
["Mese di Agosto - 2018",null,null,null,null,null,"Totali Spese Sostenute",null,{"$f":"C38+G38+I38+K38+M38","v":0},null,"Capitale Attuale",{"$f":"SUM(Luglio!L39)-SUM(A38-G38-I38-K38-M38)+C40","v":0}]
["CAPITALE INIZIALE",null,null,null,null,null,"Debito a metà del mese successivo",null,{"$f":"SUM(Luglio!G15:G35)+SUM(G5:G14)","v":0},null,{"$f":"IF(L39<=1,\"ATTENZIONE: capitale in negativo!\",\"\")","v":"ATTENZIONE: capitale in negativo!"}]

{"sheet":"Settembre","index":11,"n_rows":40,"n_cols":13,"rows_kept":40,"cut":false,"hidden":false,"merged":[[2,0,3,0],[2,5,3,5],[0,11,35,11],[0,9,35,9],[0,7,35,7],[0,4,35,4],[39,0,39,1],[39,6,39,7],[39,10,39,12],[1,0,1,3],[0,0,0,3],[38,0,38,2],[38,11,38,12],[38,6,38,7],[0,12,3,12],[2,10,3,10],[2,8,3,8],[2,6,3,6],[2,3,3,3],[2,2,3,2],[2,1,3,1]]}
["N° CARTA PREPAGATA",null,null,null,null,null,"N° CARTA di CREDITO",null,"N° BANCOMAT",null,"N° ASSEGNI",null,"Prelievi"]
["XXXXX",null,null,null,null,null,"XXXXX",null,"XXXXX",null,"XXXXX"]
["Ricariche","CAPITALE","SPESE","RESTANTE",null,"Giorni","SPESE",null,"SPESE",null,"SPESE"]
[]
[{"$f":"Agosto!A38-Agosto!C38","v":0},{"$f":"A5","v":0},null,{"$f":"IF(B5=\"\",\"\",IF(C5=\"\",\"\",IF(B5-C5=\"\",\"\",IF(B5-C5<=0,\"Caricare la Carta\",B5-C5))))","v":""},null,"S-1"]
[null,{"$f":"IF(D5=\"\",\"\",IF(B5-C5=0,A6,IF(OR(D5=\"Caricare la Carta\",D5=B5),A6+B5,D5)))","v":""},null,{"$f":"IF(B6=\"\",\"\",IF(C6=\"\",\"\",IF(B6-C6=\"\",\"\",IF(B6-C6<=0,\"Caricare la Carta\",B6-C6))))","v":""},null,"D-2"]
[null,{"$f":"IF(D6=\"\",\"\",IF(B6-C6=0,A7,IF(OR(D6=\"Caricare la Carta\",D6=B6),A7+B6,D6)))","v":""},null,"",null,"L-3"]
[null,"",null,"",null,"M-4"]
[null,"",null,"",null,"M-5"]
[null,"",null,"",null,"G-6"]
[null,"",null,"",null,"V-7"]
[null,"",null,"",null,"S-8"]
[null,"",null,"",null,"D-9"]
[null,"",null,"",null,"L-10"]
[null,"",null,"",null,"M-11"]
[null,"",null,"",null,"M-12"]
[null,"",null,"",null,"G-13"]
[null,"",null,"",null,"V-14"]
[null,"",null,"",null,"S-15"]
[null,"",null,"",null,"D-16"]
[null,"",null,"",null,"L-17"]
[null,"",null,"",null,"M-18"]
[null,"",null,"",null,"M-19"]
[null,"",null,"",null,"G-20"]
[null,"",null,"",null,"V-21"]
[null,"",null,"",null,"S-22"]
[null,"",null,"",null,"D-23"]
[null,"",null,"",null,"L-24"]
[null,"",null,"",null,"M-25"]
[null,"",null,"",null,"M-26"]
[null,"",null,"",null,"G-27"]
[null,"",null,"",null,"V-28"]
[null,"",null,"",null,"S-29"]
[null,"",null,"",null,"D-30"]
[null,"",null,""]
[null,"",null,""]
[]
[{"$f":"SUM(A5:A36)","v":0},null,{"$f":"SUM(C5:C36)","v":0},null,null,null,{"$f":"SUM(G5:G35)","v":0},null,{"$f":"SUM(I5:I35)","v":0},null,{"$f":"SUM(K5:K35)","v":0},null,{"$f":"SUM(M5:M35)","v":0}]
["Mese di Settembre - 2018",null,null,null,null,null,"Totali Spese Sostenute",null,{"$f":"C38+G38+I38+K38+M38","v":0},null,"Capitale Attuale",{"$f":"SUM(Agosto!L39)-SUM(A38-G38-I38-K38-M38)+C40","v":0}]
["CAPITALE INIZIALE",null,null,null,null,null,"Debito a metà del mese successivo",null,{"$f":"SUM(Agosto!G15:G35)+SUM(G5:G14)","v":0},null,{"$f":"IF(L39<=1,\"ATTENZIONE: capitale in negativo!\",\"\")","v":"ATTENZIONE: capitale in negativo!"}]

{"sheet":"Ottobre","index":12,"n_rows":40,"n_cols":13,"rows_kept":40,"cut":false,"hidden":false,"merged":[[2,0,3,0],[2,5,3,5],[0,11,35,11],[0,9,35,9],[0,7,35,7],[0,4,35,4],[39,0,39,1],[39,6,39,7],[39,10,39,12],[1,0,1,3],[0,0,0,3],[38,0,38,2],[38,11,38,12],[38,6,38,7],[0,12,3,12],[2,10,3,10],[2,8,3,8],[2,6,3,6],[2,3,3,3],[2,2,3,2],[2,1,3,1]]}
["N° CARTA PREPAGATA",null,null,null,null,null,"N° CARTA di CREDITO",null,"N° BANCOMAT",null,"N° ASSEGNI",null,"Prelievi"]
["XXXXX",null,null,null,null,null,"XXXXX",null,"XXXXX",null,"XXXXX"]
["Ricariche","CAPITALE","SPESE","RESTANTE",null,"Giorni","SPESE",null,"SPESE",null,"SPESE"]
[]
[{"$f":"Settembre!A38-Settembre!C38","v":0},{"$f":"A5","v":0},null,{"$f":"IF(B5=\"\",\"\",IF(C5=\"\",\"\",IF(B5-C5=\"\",\"\",IF(B5-C5<=0,\"Caricare la Carta\",B5-C5))))","v":""},null,"L-1"]
[null,{"$f":"IF(D5=\"\",\"\",IF(B5-C5=0,A6,IF(OR(D5=\"Caricare la Carta\",D5=B5),A6+B5,D5)))","v":""},null,{"$f":"IF(B6=\"\",\"\",IF(C6=\"\",\"\",IF(B6-C6=\"\",\"\",IF(B6-C6<=0,\"Caricare la Carta\",B6-C6))))","v":""},null,"M-2"]
[null,{"$f":"IF(D6=\"\",\"\",IF(B6-C6=0,A7,IF(OR(D6=\"Caricare la Carta\",D6=B6),A7+B6,D6)))","v":""},null,"",null,"M-3"]
[null,"",null,"",null,"G-4"]
[null,"",null,"",null,"V-5"]
[null,"",null,"",null,"S-6"]
[null,"",null,"",null,"D-7"]
[null,"",null,"",null,"L-8"]
[null,"",null,"",null,"M-9"]
[null,"",null,"",null,"M-10"]
[null,"",null,"",null,"G-11"]
[null,"",null,"",null,"V-12"]
[null,"",null,"",null,"S-13"]
[null,"",null,"",null,"D-14"]
[null,"",null,"",null,"L-15"]
[null,"",null,"",null,"M-16"]
[null,"",null,"",null,"M-17"]
[null,"",null,"",null,"G-18"]
[null,"",null,"",null,"V-19"]
[null,"",null,"",null,"S-20"]
[null,"",null,"",null,"D-21"]
[null,"",null,"",null,"L-22"]
[null,"",null,"",null,"M-23"]
[null,"",null,"",null,"M-24"]
[null,"",null,"",null,"G-25"]
[null,"",null,"",null,"V-26"]
[null,"",null,"",null,"S-27"]
[null,"",null,"",null,"D-28"]
[null,"",null,"",null,"L-29"]
[null,"",null,"",null,"M-30"]
[null,"",null,"",null,"M-31"]
[null,"",null,""]
[]
[{"$f":"SUM(A5:A36)","v":0},null,{"$f":"SUM(C5:C36)","v":0},null,null,null,{"$f":"SUM(G5:G35)","v":0},null,{"$f":"SUM(I5:I35)","v":0},null,{"$f":"SUM(K5:K35)","v":0},null,{"$f":"SUM(M5:M35)","v":0}]
["Mese di Ottobre - 2018",null,null,null,null,null,"Totali Spese Sostenute",null,{"$f":"C38+G38+I38+K38+M38","v":0},null,"Capitale Attuale",{"$f":"SUM(Settembre!L39)-SUM(A38-G38-I38-K38-M38)+C40","v":0}]
["CAPITALE INIZIALE",null,null,null,null,null,"Debito a metà del mese successivo",null,{"$f":"SUM(Settembre!G15:G34)+SUM(G5:G14)","v":0},null,{"$f":"IF(L39<=1,\"ATTENZIONE: capitale in negativo!\",\"\")","v":"ATTENZIONE: capitale in negativo!"}]

{"sheet":"Novembre","index":13,"n_rows":40,"n_cols":13,"rows_kept":40,"cut":false,"hidden":false,"merged":[[2,0,3,0],[2,5,3,5],[0,11,35,11],[0,9,35,9],[0,7,35,7],[0,4,35,4],[39,0,39,1],[39,6,39,7],[39,10,39,12],[1,0,1,3],[0,0,0,3],[38,0,38,2],[38,11,38,12],[38,6,38,7],[0,12,3,12],[2,10,3,10],[2,8,3,8],[2,6,3,6],[2,3,3,3],[2,2,3,2],[2,1,3,1]]}
["N° CARTA PREPAGATA",null,null,null,null,null,"N° CARTA di CREDITO",null,"N° BANCOMAT",null,"N° ASSEGNI",null,"Prelievi"]
["XXXXX",null,null,null,null,null,"XXXXX",null,"XXXXX",null,"XXXXX"]
["Ricariche","CAPITALE","SPESE","RESTANTE",null,"Giorni","SPESE",null,"SPESE",null,"SPESE"]
[]
[{"$f":"Ottobre!A38-Ottobre!C38","v":0},{"$f":"A5","v":0},null,{"$f":"IF(B5=\"\",\"\",IF(C5=\"\",\"\",IF(B5-C5=\"\",\"\",IF(B5-C5<=0,\"Caricare la Carta\",B5-C5))))","v":""},null,"G-1"]
[null,{"$f":"IF(D5=\"\",\"\",IF(B5-C5=0,A6,IF(OR(D5=\"Caricare la Carta\",D5=B5),A6+B5,D5)))","v":""},null,{"$f":"IF(B6=\"\",\"\",IF(C6=\"\",\"\",IF(B6-C6=\"\",\"\",IF(B6-C6<=0,\"Caricare la Carta\",B6-C6))))","v":""},null,"V-2"]
[null,{"$f":"IF(D6=\"\",\"\",IF(B6-C6=0,A7,IF(OR(D6=\"Caricare la Carta\",D6=B6),A7+B6,D6)))","v":""},null,"",null,"S-3"]
[null,"",null,"",null,"D-4"]
[null,"",null,"",null,"L-5"]
[null,"",null,"",null,"M-6"]
[null,"",null,"",null,"M-7"]
[null,"",null,"",null,"G-8"]
[null,"",null,"",null,"V-9"]
[null,"",null,"",null,"S-10"]
[null,"",null,"",null,"D-11"]
[null,"",null,"",null,"L-12"]
[null,"",null,"",null,"M-13"]
[null,"",null,"",null,"M-14"]
[null,"",null,"",null,"G-15"]
[null,"",null,"",null,"V-16"]
[null,"",null,"",null,"S-17"]
[null,"",null,"",null,"D-18"]
[null,"",null,"",null,"L-19"]
[null,"",null,"",null,"M-20"]
[null,"",null,"",null,"M-21"]
[null,"",null,"",null,"G-22"]
[null,"",null,"",null,"V-23"]
[null,"",null,"",null,"S-24"]
[null,"",null,"",null,"D-25"]
[null,"",null,"",null,"L-26"]
[null,"",null,"",null,"M-27"]
[null,"",null,"",null,"M-28"]
[null,"",null,"",null,"G-29"]
[null,"",null,"",null,"V-30"]
[null,"",null,""]
[null,"",null,""]
[]
[{"$f":"SUM(A5:A36)","v":0},null,{"$f":"SUM(C5:C36)","v":0},null,null,null,{"$f":"SUM(G5:G35)","v":0},null,{"$f":"SUM(I5:I35)","v":0},null,{"$f":"SUM(K5:K35)","v":0},null,{"$f":"SUM(M5:M35)","v":0}]
["Mese di Novembre - 2018",null,null,null,null,null,"Totali Spese Sostenute",null,{"$f":"C38+G38+I38+K38+M38","v":0},null,"Capitale Attuale",{"$f":"SUM(Ottobre!L39)-SUM(A38-G38-I38-K38-M38)+C40","v":0}]
["CAPITALE INIZIALE",null,null,null,null,null,"Debito a metà del mese successivo",null,{"$f":"SUM(Ottobre!G15:G35)+SUM(G5:G14)","v":0},null,{"$f":"IF(L39<=1,\"ATTENZIONE: capitale in negativo!\",\"\")","v":"ATTENZIONE: capitale in negativo!"}]

{"sheet":"Dicembre","index":14,"n_rows":40,"n_cols":13,"rows_kept":40,"cut":false,"hidden":false,"merged":[[2,0,3,0],[2,5,3,5],[0,11,35,11],[0,9,35,9],[0,7,35,7],[0,4,35,4],[39,0,39,1],[39,6,39,7],[39,10,39,12],[1,0,1,3],[0,0,0,3],[38,0,38,2],[38,11,38,12],[38,6,38,7],[0,12,3,12],[2,10,3,10],[2,8,3,8],[2,6,3,6],[2,3,3,3],[2,2,3,2],[2,1,3,1]]}
["N° CARTA PREPAGATA",null,null,null,null,null,"N° CARTA di CREDITO",null,"N° BANCOMAT",null,"N° ASSEGNI",null,"Prelievi"]
["XXXXX",null,null,null,null,null,"XXXXX",null,"XXXXX",null,"XXXXX"]
["Ricariche","CAPITALE","SPESE","RESTANTE",null,"Giorni","SPESE",null,"SPESE",null,"SPESE"]
[]
[{"$f":"Novembre!A38-Novembre!C38","v":0},{"$f":"A5","v":0},null,{"$f":"IF(B5=\"\",\"\",IF(C5=\"\",\"\",IF(B5-C5=\"\",\"\",IF(B5-C5<=0,\"Caricare la Carta\",B5-C5))))","v":""},null,"S-1"]
[null,{"$f":"IF(D5=\"\",\"\",IF(B5-C5=0,A6,IF(OR(D5=\"Caricare la Carta\",D5=B5),A6+B5,D5)))","v":""},null,{"$f":"IF(B6=\"\",\"\",IF(C6=\"\",\"\",IF(B6-C6=\"\",\"\",IF(B6-C6<=0,\"Caricare la Carta\",B6-C6))))","v":""},null,"D-2"]
[null,{"$f":"IF(D6=\"\",\"\",IF(B6-C6=0,A7,IF(OR(D6=\"Caricare la Carta\",D6=B6),A7+B6,D6)))","v":""},null,"",null,"L-3"]
[null,"",null,"",null,"M-4"]
[null,"",null,"",null,"M-5"]
[null,"",null,"",null,"G-6"]
[null,"",null,"",null,"V-7"]
[null,"",null,"",null,"S-8"]
[null,"",null,"",null,"D-9"]
[null,"",null,"",null,"L-10"]
[null,"",null,"",null,"M-11"]
[null,"",null,"",null,"M-12"]
[null,"",null,"",null,"G-13"]
[null,"",null,"",null,"V-14"]
[null,"",null,"",null,"S-15"]
[null,"",null,"",null,"D-16"]
[null,"",null,"",null,"L-17"]
[null,"",null,"",null,"M-18"]
[null,"",null,"",null,"M-19"]
[null,"",null,"",null,"G-20"]
[null,"",null,"",null,"V-21"]
[null,"",null,"",null,"S-22"]
[null,"",null,"",null,"D-23"]
[null,"",null,"",null,"L-24"]
[null,"",null,"",null,"M-25"]
[null,"",null,"",null,"M-26"]
[null,"",null,"",null,"G-27"]
[null,"",null,"",null,"V-28"]
[null,"",null,"",null,"S-29"]
[null,"",null,"",null,"D-30"]
[null,"",null,"",null,"L-31"]
[null,"",null,""]
[]
[{"$f":"SUM(A5:A36)","v":0},null,{"$f":"SUM(C5:C36)","v":0},null,null,null,{"$f":"SUM(G5:G35)","v":0},null,{"$f":"SUM(I5:I35)","v":0},null,{"$f":"SUM(K5:K35)","v":0},null,{"$f":"SUM(M5:M35)","v":0}]
["Mese di Dicembre - 2018",null,null,null,null,null,"Totali Spese Sostenute",null,{"$f":"C38+G38+I38+K38+M38","v":0},null,"Capitale Attuale",{"$f":"SUM(Novembre!L39)-SUM(A38-G38-I38-K38-M38)+C40","v":0}]
["CAPITALE INIZIALE",null,null,null,null,null,"Debito a metà del mese successivo",null,{"$f":"SUM(Novembre!G15:G34)+SUM(G5:G14)","v":0},null,{"$f":"IF(L39<=1,\"ATTENZIONE: capitale in negativo!\",\"\")","v":"ATTENZIONE: capitale in negativo!"}]

{"sheet":"Gennaio-2019","index":15,"n_rows":40,"n_cols":13,"rows_kept":40,"cut":false,"hidden":false,"merged":[[2,0,3,0],[2,5,3,5],[0,11,35,11],[0,9,35,9],[0,7,35,7],[0,4,35,4],[39,0,39,1],[39,6,39,7],[39,10,39,12],[0,0,0,3],[1,0,1,3],[38,0,38,2],[38,6,38,7],[38,11,38,12],[0,12,3,12],[2,10,3,10],[2,8,3,8],[2,6,3,6],[2,3,3,3],[2,2,3,2],[2,1,3,1]]}
["N° CARTA PREPAGATA",null,null,null,null,null,"N° CARTA di CREDITO",null,"N° BANCOMAT",null,"N° ASSEGNI",null,"Prelievi"]
["XXXXX",null,null,null,null,null,"XXXXX",null,"XXXXX",null,"XXXXX"]
["Ricariche","CAPITALE","SPESE","RESTANTE",null,"Giorni","SPESE",null,"SPESE",null,"SPESE"]
[]
[{"$f":"Dicembre!A38-Dicembre!C38","v":0},{"$f":"A5","v":0},null,{"$f":"IF(B5=\"\",\"\",IF(C5=\"\",\"\",IF(B5-C5=\"\",\"\",IF(B5-C5<=0,\"Caricare la Carta\",B5-C5))))","v":""},null,"M-1"]
[null,{"$f":"IF(D5=\"\",\"\",IF(B5-C5=0,A6,IF(OR(D5=\"Caricare la Carta\",D5=B5),A6+B5,D5)))","v":""},null,{"$f":"IF(B6=\"\",\"\",IF(C6=\"\",\"\",IF(B6-C6=\"\",\"\",IF(B6-C6<=0,\"Caricare la Carta\",B6-C6))))","v":""},null,"M-2"]
[null,{"$f":"IF(D6=\"\",\"\",IF(B6-C6=0,A7,IF(OR(D6=\"Caricare la Carta\",D6=B6),A7+B6,D6)))","v":""},null,"",null,"G-3"]
[null,"",null,"",null,"V-4"]
[null,"",null,"",null,"S-5"]
[null,"",null,"",null,"D-6"]
[null,"",null,"",null,"L-7"]
[null,"",null,"",null,"M-8"]
[null,"",null,"",null,"M-9"]
[null,"",null,"",null,"G-10"]
[null,"",null,"",null,"V-11"]
[null,"",null,"",null,"S-12"]
[null,"",null,"",null,"D-13"]
[null,"",null,"",null,"L-14"]
[null,"",null,"",null,"M-15"]
[null,"",null,"",null,"M-16"]
[null,"",null,"",null,"G-17"]
[null,"",null,"",null,"V-18"]
[null,"",null,"",null,"S-19"]
[null,"",null,"",null,"D-20"]
[null,"",null,"",null,"L-21"]
[null,"",null,"",null,"M-22"]
[null,"",null,"",null,"M-23"]
[null,"",null,"",null,"G-24"]
[null,"",null,"",null,"V-25"]
[null,"",null,"",null,"S-26"]
[null,"",null,"",null,"D-27"]
[null,"",null,"",null,"L-28"]
[null,"",null,"",null,"M-29"]
[null,"",null,"",null,"M-30"]
[null,"",null,"",null,"G-31"]
[null,"",null,""]
[]
[{"$f":"SUM(A5:A36)","v":0},null,{"$f":"SUM(C5:C36)","v":0},null,null,null,{"$f":"SUM(G5:G35)","v":0},null,{"$f":"SUM(I5:I35)","v":0},null,{"$f":"SUM(K5:K35)","v":0},null,{"$f":"SUM(M5:M35)","v":0}]
["Mese di Gennaio - 2019",null,null,null,null,null,"Totali Spese Sostenute",null,{"$f":"C38+G38+I38+K38+M38","v":0},null,"Capitale Attuale",{"$f":"SUM(Dicembre!L39)-SUM(A38-G38-I38-K38-M38)+C40","v":0}]
["CAPITALE INIZIALE",null,null,null,null,null,"Debito a metà del mese successivo",null,{"$f":"SUM(Dicembre!G15:G35)+SUM(G5:G14)","v":0},null,{"$f":"IF(L39<=1,\"ATTENZIONE: capitale in negativo!\",\"\")","v":"ATTENZIONE: capitale in negativo!"}]